{"text_format":"1","workbook":"xlsx","n_sheets":11,"sheets":["HABILITE AS MACROS","INDEX","AJUDA","Licença","Dashboard Controle","Dashboard Análise","Configurações","config","Vendas","Produtos","Clientes"],"not_rendered":{"charts":13,"images":6,"macros":1,"external_links":0,"defined_names":2,"comments":0,"pivot_tables":0},"unopened":[],"bounds":{"document_bytes":16777216,"sheet_cells":100000,"rows_first":2000,"rows_last":500,"rows_between":2000,"halvings":0,"cell_chars":16384,"cell_head_chars":4096},"cells_cut":0,"cells_raw":0,"read":"whole","date_system":"1900"}

{"sheet":"HABILITE AS MACROS","index":0,"n_rows":0,"n_cols":0,"rows_kept":0,"cut":false,"hidden":false,"merged":[]}

{"sheet":"INDEX","index":1,"n_rows":0,"n_cols":0,"rows_kept":0,"cut":false,"hidden":true,"merged":[]}

{"sheet":"AJUDA","index":2,"n_rows":0,"n_cols":0,"rows_kept":0,"cut":false,"hidden":true,"merged":[]}

{"sheet":"Licença","index":3,"n_rows":22,"n_cols":3,"rows_kept":22,"cut":false,"hidden":true,"merged":[[19,2,19,11],[21,2,21,11]]}
[]
[]
[]
[]
[]
[]
[]
[]
[]
[]
[]
[]
[]
[]
[]
[]
[]
[]
[]
[null,"Email da Compra:"]
[]
[null,"Status da compra:","Você está no período de teste. Não é necessário validar no momento"]

{"sheet":"Dashboard Controle","index":4,"n_rows":0,"n_cols":0,"rows_kept":0,"cut":false,"hidden":true,"merged":[]}

{"sheet":"Dashboard Análise","index":5,"n_rows":55,"n_cols":2,"rows_kept":55,"cut":false,"hidden":true,"merged":[[54,1,54,6]]}
[]
[]
[]
[]
[]
[]
[]
[]
[]
[]
[]
[]
[]
[]
[]
[]
[]
[]
[]
[]
[]
[]
[]
[]
[]
[]
[]
[]
[]
[]
[]
[]
[]
[]
[]
[]
[]
[]
[]
[]
[]
[]
[]
[]
[]
[]
[]
[]
[]
[]
[]
[]
[]
[]
[null,"Celular GammaZ"]

{"sheet":"Configurações","index":6,"n_rows":18,"n_cols":16,"rows_kept":18,"cut":false,"hidden":true,"merged":[[3,1,3,2],[3,9,3,10],[8,9,9,10]]}
[]
[]
[]
[null,"Preencha aqui os feriados em que sua empresa não irá abrir.",null,null,"Informe qual dia da semana seu empresa fecha:",null,null,"Informe sua meta diária de vendas:",null,"Configure as faixas de performance",null,null,null,"Informe o título de novos parâmetros para o cadastro de produto",null,"Informe o título de novos parâmetros para o cadastro de cliente"]
[null,"Data","Descrição",null,"Nunca",null,null,1500,null,"RUIM",0.5,{"$f":"\"(0 a \"&TEXT(K5,\"0%\"&\")\")","v":"(0 a 50%)"},null,"Especificação 1:",null,"Parâmetro 1:"]
[null,"2023-01-01","Confraternização Universal",null,"(clique na célula acima para escolher)",null,null,null,null,"RAZOÁVEL",0.75,{"$f":"\"(\"&  TEXT(K5,\"0%\")  &\" a \"&TEXT(K6,\"0%\"&\")\")","v":"(50% a 75%)"},null,"Especificação 2:",null,"Parâmetro 2:"]
[null,"2023-02-20","Carnaval",null,null,null,null,null,null,"BOA",0.9,{"$f":"\"(\"&  TEXT(K6,\"0%\")  &\" a \"&TEXT(K7,\"0%\"&\")\")","v":"(75% a 90%)"},null,"Especificação 3:",null,"Parâmetro 3:"]
[null,"2023-02-21","Carnaval",null,null,null,null,null,null,"EXCELENTE","(não preencher)",{"$f":"\"(\"&TEXT(K7,\"0%\")&\" a 100%)\"","v":"(90% a 100%)"}]
[null,"2023-04-07","Paixão de Cristo",null,null,null,null,null,null,"Preencher o valor dos 3 primeiros."]
[null,"2023-04-21","Tiradentes"]
[null,"2023-04-09","Páscoa"]
[null,"2023-05-01","Dia do Trabalhador"]
[null,"2023-06-08","Corpo de Cristo"]
[null,"2023-09-07","Independência"]
[null,"2023-10-12","Nossa Senhora Aparecida"]
[null,"2023-11-02","Finados"]
[null,"2023-11-15","Proclamação da República"]
[null,"2023-12-25","Natal"]

{"sheet":"config","index":7,"n_rows":135,"n_cols":42,"rows_kept":135,"cut":false,"hidden":true,"merged":[[8,3,8,4]]}
["hoje",{"$f":"TODAY()+B2","v":"2023-11-24"}]
["offset",null,null,null,null,null,null,null,"Mensagem Produto"]
["mês",{"$f":"MONTH(B1)","v":11},null,null,null,null,null,null,"Tudo ok! Planilha licenciada"]
["ano",{"$f":"YEAR(B1)","v":2023}]
["DIA",{"$f":"DAY(B1)","v":24}]
[]
["Dia Atual",null,null,null,null,null,null,null,null,null,null,"Ontem"]
[]
["Quantidade",{"$f":"SUMIF(Vendas!A:A,B1,Vendas!E:E)","v":0},null,"meta"]
["Valor",{"$f":"SUMIF(Vendas!A:A,config!B1,Vendas!G:G)","v":0},null,{"$f":"IFERROR(B10/meta_dia,\"-\")","v":0},"realizado",null,null,null,null,null,null,"Valor",{"$f":"SUMIF(Vendas!A:A,config!B1-1,Vendas!G:G)","v":0}]
[null,null,null,{"$f":"IF(D10>1,0,1-D10)","v":1},"restante"]
[]
[]
[]
["Ticket Médio",{"$f":"IFERROR(B10/B9,\"-\")","v":"-"}]
[]
["Mês Atual",{"$f":"EOMONTH(B1,-1)+1","v":"2023-11-01"},{"$f":"EOMONTH(B1,0)","v":"2023-11-30"},null,{"$f":"B17","v":"2023-11-01"},null,null,null,null,null,null,"Faturamento últimos 7 dias",null,{"$f":"\"(VENDAS DE \"&TEXT(N19,\"dd/mm/aaaa\") &\" à \"&TEXT(T19,\"dd/mm/aaaa\")&\")\"","v":"(VENDAS DE 18/11/2023 à 24/11/2023)"}]
[]
["Produtos",{"$f":"COUNTIFS(Vendas!A:A,\">=\"&config!B17,Vendas!A:A,\"<=\"&config!C17)","v":0},null,null,null,null,null,null,null,"Gráfico %","LABEL",null,"Dia",{"$f":"O19-1","v":"2023-11-18"},"2023-11-19","2023-11-20","2023-11-21","2023-11-22",{"$f":"T19-1","v":"2023-11-23"},{"$f":"B1","v":"2023-11-24"}]
["Faturamento",{"$f":"SUMIFS(Vendas!G:G,Vendas!A:A,\">=\"&config!B17,Vendas!A:A,\"<=\"&config!C17)","v":0},null,null,"Dias úteis restantes",{"$f":"IF(D33=0,       (C17 - B1 + 1) - COUNTIFS(tab_feriados[Data],\">=\"&B1,tab_feriados[Data],\"<=\"&C17),NETWORKDAYS.INTL(B1,C17,D33,tab_feriados[Data]))","v":7},null,null,"Realizado",{"$f":"IFERROR(IF(B20/B21>1,1,B20/B21),\"-\")","v":0},{"$f":"IFERROR(B20/B21,\"-\")","v":0},null,"Faturamento",{"$f":"SUMIF(Vendas!$A:$A,config!N19,Vendas!$G:$G)","v":0},{"$f":"SUMIF(Vendas!$A:$A,config!O19,Vendas!$G:$G)","v":0},{"$f":"SUMIF(Vendas!$A:$A,config!P19,Vendas!$G:$G)","v":0},{"$f":"SUMIF(Vendas!$A:$A,config!Q19,Vendas!$G:$G)","v":0},{"$f":"SUMIF(Vendas!$A:$A,config!R19,Vendas!$G:$G)","v":0},{"$f":"SUMIF(Vendas!$A:$A,config!S19,Vendas!$G:$G)","v":0},{"$f":"SUMIF(Vendas!$A:$A,config!T19,Vendas!$G:$G)","v":0}]
["Meta Mês",{"$f":"meta_dia*F25","v":42000},null,null,"Dias úteis passado",{"$f":"IF(D33=0,    ((B1-1) - B17 + 1) - COUNTIFS(tab_feriados[Data],\">=\"&B17,tab_feriados[Data],\"<=\"&B1),NETWORKDAYS.INTL(B17,B1-1,D33,tab_feriados[Data]))","v":21},null,null,"Pendente",{"$f":"IFERROR(IF(J20>=1,0,1-J20),\"-\")","v":1}]
[]
["Faturamento Diário",{"$f":"B20/F21","v":0}]
["Projeção",{"$f":"B20 + B23*F20","v":0},"% para texto"]
["% Projeção da Meta",{"$f":"IFERROR(IF(B24/(meta_dia*F25)>1,1,B24/(meta_dia*F25)),\"-\")","v":0},{"$f":"IFERROR((B24/(meta_dia*F25)),\"-\")","v":0},null,"Dias úteis do mês",{"$f":"IF(D33=0,           (C17 - B17 + 1) - COUNTIFS(tab_feriados[Data],\">=\"&B17,tab_feriados[Data],\"<=\"&C17),NETWORKDAYS.INTL(B17,C17,D33,tab_feriados[Data]))","v":28},null,null,null,null,null,1,{"$f":"IF(L25=\"\",\"\",IF(L25+1>DAY($C$17),\"\",L25+1))","v":2},{"$f":"IF(M25=\"\",\"\",IF(M25+1>DAY($C$17),\"\",M25+1))","v":3},4,5,6,7,8,9,10,11,12,13,14,15,16,17,18,19,20,21,22,23,24,25,26,27,28,29,30,""]
["Marcador",0.01,null,null,null,null,null,null,null,null,"Data",{"$f":"IF(L25=\"\",\"\",DATE($B$4,$B$3,L25))","v":"2023-11-01"},{"$f":"IF(M25=\"\",\"\",DATE($B$4,$B$3,M25))","v":"2023-11-02"},"2023-11-03","2023-11-04","2023-11-05","2023-11-06","2023-11-07","2023-11-08","2023-11-09","2023-11-10","2023-11-11","2023-11-12","2023-11-13","2023-11-14","2023-11-15","2023-11-16","2023-11-17","2023-11-18","2023-11-19","2023-11-20","2023-11-21","2023-11-22","2023-11-23","2023-11-24","2023-11-25","2023-11-26","2023-11-27","2023-11-28","2023-11-29","2023-11-30",""]
["Restante (Graf Veloc)",{"$f":"IFERROR(IF(B25=1,0.99,2-B25-B26),\"-\")","v":1.99},null,null,"Hoje, deveria ter faturado até hoje:",{"$f":"meta_dia*F21","v":31500},null,null,null,null,"Faturamento",{"$f":"IF(L26=\"\",\"\",SUMIFS(Vendas!$G:$G,Vendas!$A:$A,L26))","v":0},{"$f":"IF(M26=\"\",\"\",SUMIFS(Vendas!$G:$G,Vendas!$A:$A,M26))","v":0},{"$f":"IF(N26=\"\",\"\",SUMIFS(Vendas!$G:$G,Vendas!$A:$A,N26))","v":0},{"$f":"IF(O26=\"\",\"\",SUMIFS(Vendas!$G:$G,Vendas!$A:$A,O26))","v":0},{"$f":"IF(P26=\"\",\"\",SUMIFS(Vendas!$G:$G,Vendas!$A:$A,P26))","v":0},{"$f":"IF(Q26=\"\",\"\",SUMIFS(Vendas!$G:$G,Vendas!$A:$A,Q26))","v":0},{"$f":"IF(R26=\"\",\"\",SUMIFS(Vendas!$G:$G,Vendas!$A:$A,R26))","v":0},{"$f":"IF(S26=\"\",\"\",SUMIFS(Vendas!$G:$G,Vendas!$A:$A,S26))","v":0},{"$f":"IF(T26=\"\",\"\",SUMIFS(Vendas!$G:$G,Vendas!$A:$A,T26))","v":0},{"$f":"IF(U26=\"\",\"\",SUMIFS(Vendas!$G:$G,Vendas!$A:$A,U26))","v":0},{"$f":"IF(V26=\"\",\"\",SUMIFS(Vendas!$G:$G,Vendas!$A:$A,V26))","v":0},{"$f":"IF(W26=\"\",\"\",SUMIFS(Vendas!$G:$G,Vendas!$A:$A,W26))","v":0},{"$f":"IF(X26=\"\",\"\",SUMIFS(Vendas!$G:$G,Vendas!$A:$A,X26))","v":0},{"$f":"IF(Y26=\"\",\"\",SUMIFS(Vendas!$G:$G,Vendas!$A:$A,Y26))","v":0},{"$f":"IF(Z26=\"\",\"\",SUMIFS(Vendas!$G:$G,Vendas!$A:$A,Z26))","v":0},{"$f":"IF(AA26=\"\",\"\",SUMIFS(Vendas!$G:$G,Vendas!$A:$A,AA26))","v":0},{"$f":"IF(AB26=\"\",\"\",SUMIFS(Vendas!$G:$G,Vendas!$A:$A,AB26))","v":0},{"$f":"IF(AC26=\"\",\"\",SUMIFS(Vendas!$G:$G,Vendas!$A:$A,AC26))","v":0},{"$f":"IF(AD26=\"\",\"\",SUMIFS(Vendas!$G:$G,Vendas!$A:$A,AD26))","v":0},{"$f":"IF(AE26=\"\",\"\",SUMIFS(Vendas!$G:$G,Vendas!$A:$A,AE26))","v":0},{"$f":"IF(AF26=\"\",\"\",SUMIFS(Vendas!$G:$G,Vendas!$A:$A,AF26))","v":0},{"$f":"IF(AG26=\"\",\"\",SUMIFS(Vendas!$G:$G,Vendas!$A:$A,AG26))","v":0},{"$f":"IF(AH26=\"\",\"\",SUMIFS(Vendas!$G:$G,Vendas!$A:$A,AH26))","v":0},{"$f":"IF(AI26=\"\",\"\",SUMIFS(Vendas!$G:$G,Vendas!$A:$A,AI26))","v":0},{"$f":"IF(AJ26=\"\",\"\",SUMIFS(Vendas!$G:$G,Vendas!$A:$A,AJ26))","v":0},{"$f":"IF(AK26=\"\",\"\",SUMIFS(Vendas!$G:$G,Vendas!$A:$A,AK26))","v":0},{"$f":"IF(AL26=\"\",\"\",SUMIFS(Vendas!$G:$G,Vendas!$A:$A,AL26))","v":0},{"$f":"IF(AM26=\"\",\"\",SUMIFS(Vendas!$G:$G,Vendas!$A:$A,AM26))","v":0},{"$f":"IF(AN26=\"\",\"\",SUMIFS(Vendas!$G:$G,Vendas!$A:$A,AN26))","v":0},{"$f":"IF(AO26=\"\",\"\",SUMIFS(Vendas!$G:$G,Vendas!$A:$A,AO26))","v":0},{"$f":"IF(AP26=\"\",\"\",SUMIFS(Vendas!$G:$G,Vendas!$A:$A,AP26))","v":""}]
["Texto",{"$f":"\"Para você atingir \" & TEXT(B21, \"R$ #.##0,00\") & \" (meta mensal) de faturamento até o final do mês, você deveria ter faturado até hoje \" & TEXT(F27, \"R$ #.##0,00\") & \" . Você já faturou \"& TEXT(C25, \"0,0%\") &\" desse valor.\"","v":"Para você atingir R$ 42.000,00 (meta mensal) de faturamento até o final do mês, você deveria ter faturado até hoje R$ 31.500,00 . Você já faturou 0,0% desse valor."}]
["Configurações"]
[]
["Opção Fechamento"]
["Nunca",0,null,"Item Escolhido",null,null,null,"intervalos"]
["Sábado e Domingo",1,null,{"$f":"VLOOKUP(Configurações!E5,config!$A$32:$B$46,2,0)","v":0},null,null,{"$f":"Configurações!K5","v":0.5},{"$f":"G33","v":0.5},"Ruim"]
["Domingo e Segunda",2,null,null,null,null,{"$f":"Configurações!K6","v":0.75},{"$f":"G34-G33","v":0.25},"Razoável"]
["Segunda e Terça",3,null,null,null,null,{"$f":"Configurações!K7","v":0.9},{"$f":"G35-G34","v":0.15000000000000002},"Bom"]
["Terça e Quarta",4,null,null,null,null,{"$f":"Configurações!K8","v":"(não preencher)"},{"$f":"1-G35","v":9.9999999999999978E-2},"Excelente"]
["Quarta e Quinta",5,null,null,null,null,null,1,"Gráfico"]
["Quinta e Sexta",6]
["Sexta e Sábado",7,null,null,null,"Classificação"]
["Somente Domingo",11,null,null,null,{"$f":"IF(B25<=Configurações!K5,Configurações!J5,IF(B25<=Configurações!K6,Configurações!J6,IF(B25<=Configurações!K7,Configurações!J7,Configurações!J8)))","v":"RUIM"}]
["Somento Segunda",12]
["Somente Terça",13]
["Somente Quarta",14]
["Somente Quinta",15]
["Somente Sexta",16]
["Somente Sábado",17]
[]
[]
[]
[]
[]
[]
[]
[]
[]
[]
[]
[]
[]
[]
[]
[]
[]
[]
[]
[]
[]
[]
[]
[]
[]
["Dashboard Análise"]
[]
[null,null,"Incremento","Label","Label 2"]
["Dia",1]
["Mês",{"$f":"1+C76","v":11},10,{"$f":"UPPER(TEXT(DATE(B77,B76,B75), \"mmm\"))","v":"NOV"},{"$f":"UPPER(TEXT(DATE(B77,B76,B75), \"mmmm\"))","v":"NOVEMBRO"}]
["Ano",{"$f":"2000+C77","v":2023},23]
[]
["Data Escolhida",{"$f":"DATE(B77,B76,B75)","v":"2023-11-01"}]
[]
[]
["Análise Mês",{"$f":"B79","v":"2023-11-01"},{"$f":"EOMONTH(B79,0)","v":"2023-11-30"}]
[]
["Produtos",{"$f":"COUNTIFS(Vendas!A:A,\">=\"&config!B82,Vendas!A:A,\"<=\"&config!C82)","v":0}]
["Faturamento",{"$f":"SUMIFS(Vendas!G:G,Vendas!A:A,\">=\"&config!B82,Vendas!A:A,\"<=\"&config!C82)","v":0},null,null,null,{"$f":"IFERROR(WEEKDAY(F87),\"\")","v":4},{"$f":"IFERROR(WEEKDAY(G87),\"\")","v":5},6,7,1,2,3,4,5,6,7,1,2,3,4,5,6,7,1,2,3,4,5,6,7,1,2,3,4,5,""]
["Dias úteis",{"$f":"IF(D33=0,(C82 - B82 + 1) - COUNTIFS(tab_feriados[Data],\">=\"&B82,tab_feriados[Data],\"<=\"&C82),NETWORKDAYS.INTL(B82,C82,D33,tab_feriados[Data]))","v":28},null,null,null,1,{"$f":"IF(F86=\"\",\"\",IF(F86+1>DAY($C$82),\"\",F86+1))","v":2},{"$f":"IF(G86=\"\",\"\",IF(G86+1>DAY($C$82),\"\",G86+1))","v":3},4,5,6,7,8,9,10,11,12,13,14,15,16,17,18,19,20,21,22,23,24,25,26,27,28,29,30,""]
["Faturamento Diário Médio",{"$f":"IFERROR(B85/B86,\"-\")","v":0},null,null,"data",{"$f":"IF(F86=\"\",\"\",DATE($B$77,$B$76,F86))","v":"2023-11-01"},{"$f":"IF(G86=\"\",\"\",DATE($B$77,$B$76,G86))","v":"2023-11-02"},"2023-11-03","2023-11-04","2023-11-05","2023-11-06","2023-11-07","2023-11-08","2023-11-09","2023-11-10","2023-11-11","2023-11-12","2023-11-13","2023-11-14","2023-11-15","2023-11-16","2023-11-17","2023-11-18","2023-11-19","2023-11-20","2023-11-21","2023-11-22","2023-11-23","2023-11-24","2023-11-25","2023-11-26","2023-11-27","2023-11-28","2023-11-29","2023-11-30",""]
[null,null,null,null,"Faturamento",{"$f":"IF(F87=\"\",\"\",SUMIFS(Vendas!$G:$G,Vendas!$A:$A,F87))","v":0},{"$f":"IF(G87=\"\",\"\",SUMIFS(Vendas!$G:$G,Vendas!$A:$A,G87))","v":0},{"$f":"IF(H87=\"\",\"\",SUMIFS(Vendas!$G:$G,Vendas!$A:$A,H87))","v":0},{"$f":"IF(I87=\"\",\"\",SUMIFS(Vendas!$G:$G,Vendas!$A:$A,I87))","v":0},{"$f":"IF(J87=\"\",\"\",SUMIFS(Vendas!$G:$G,Vendas!$A:$A,J87))","v":0},{"$f":"IF(K87=\"\",\"\",SUMIFS(Vendas!$G:$G,Vendas!$A:$A,K87))","v":0},{"$f":"IF(L87=\"\",\"\",SUMIFS(Vendas!$G:$G,Vendas!$A:$A,L87))","v":0},{"$f":"IF(M87=\"\",\"\",SUMIFS(Vendas!$G:$G,Vendas!$A:$A,M87))","v":0},{"$f":"IF(N87=\"\",\"\",SUMIFS(Vendas!$G:$G,Vendas!$A:$A,N87))","v":0},{"$f":"IF(O87=\"\",\"\",SUMIFS(Vendas!$G:$G,Vendas!$A:$A,O87))","v":0},{"$f":"IF(P87=\"\",\"\",SUMIFS(Vendas!$G:$G,Vendas!$A:$A,P87))","v":0},{"$f":"IF(Q87=\"\",\"\",SUMIFS(Vendas!$G:$G,Vendas!$A:$A,Q87))","v":0},{"$f":"IF(R87=\"\",\"\",SUMIFS(Vendas!$G:$G,Vendas!$A:$A,R87))","v":0},{"$f":"IF(S87=\"\",\"\",SUMIFS(Vendas!$G:$G,Vendas!$A:$A,S87))","v":0},{"$f":"IF(T87=\"\",\"\",SUMIFS(Vendas!$G:$G,Vendas!$A:$A,T87))","v":0},{"$f":"IF(U87=\"\",\"\",SUMIFS(Vendas!$G:$G,Vendas!$A:$A,U87))","v":0},{"$f":"IF(V87=\"\",\"\",SUMIFS(Vendas!$G:$G,Vendas!$A:$A,V87))","v":0},{"$f":"IF(W87=\"\",\"\",SUMIFS(Vendas!$G:$G,Vendas!$A:$A,W87))","v":0},{"$f":"IF(X87=\"\",\"\",SUMIFS(Vendas!$G:$G,Vendas!$A:$A,X87))","v":0},{"$f":"IF(Y87=\"\",\"\",SUMIFS(Vendas!$G:$G,Vendas!$A:$A,Y87))","v":0},{"$f":"IF(Z87=\"\",\"\",SUMIFS(Vendas!$G:$G,Vendas!$A:$A,Z87))","v":0},{"$f":"IF(AA87=\"\",\"\",SUMIFS(Vendas!$G:$G,Vendas!$A:$A,AA87))","v":0},{"$f":"IF(AB87=\"\",\"\",SUMIFS(Vendas!$G:$G,Vendas!$A:$A,AB87))","v":0},{"$f":"IF(AC87=\"\",\"\",SUMIFS(Vendas!$G:$G,Vendas!$A:$A,AC87))","v":0},{"$f":"IF(AD87=\"\",\"\",SUMIFS(Vendas!$G:$G,Vendas!$A:$A,AD87))","v":0},{"$f":"IF(AE87=\"\",\"\",SUMIFS(Vendas!$G:$G,Vendas!$A:$A,AE87))","v":0},{"$f":"IF(AF87=\"\",\"\",SUMIFS(Vendas!$G:$G,Vendas!$A:$A,AF87))","v":0},{"$f":"IF(AG87=\"\",\"\",SUMIFS(Vendas!$G:$G,Vendas!$A:$A,AG87))","v":0},{"$f":"IF(AH87=\"\",\"\",SUMIFS(Vendas!$G:$G,Vendas!$A:$A,AH87))","v":0},{"$f":"IF(AI87=\"\",\"\",SUMIFS(Vendas!$G:$G,Vendas!$A:$A,AI87))","v":0},{"$f":"IF(AJ87=\"\",\"\",SUMIFS(Vendas!$G:$G,Vendas!$A:$A,AJ87))","v":""}]
[null,null,null,null,"Destaque Dia",{"$f":"IF(F87=\"\",\"\",IF($L$99=F86,F88,0))","v":0},{"$f":"IF(G87=\"\",\"\",IF($L$99=G86,G88,0))","v":0},0,0,0,0,0,0,0,0,0,0,0,0,0,0,0,0,0,0,0,0,0,0,0,0,0,0,0,0,""]
[]
["META Mês",{"$f":"meta_dia*B86","v":42000}]
["Realizado",{"$f":"IFERROR(B85/B91,\"-\")","v":0},null,null,"Dia da Semana",null,1,2,3,4,5,6,7]
["Label Realizado",{"$f":"IF(B92>1,\"+100%\",B92)","v":0},null,null,null,null,"DOM","SEG","TER","QUA","QUI","SEX","SÁB"]
[null,{"$f":"IFERROR(IF(B92>1,0,1-B93),\"-\")","v":1},null,null,null,null,{"$f":"SUMIFS($F$88:$AJ$88,$F$85:$AJ$85,G92)","v":0},{"$f":"SUMIFS($F$88:$AJ$88,$F$85:$AJ$85,H92)","v":0},0,0,0,0,0]
[null,null,null,null,null,null,{"$f":"IFERROR(G94/SUM($G$94:$M$94),\"-\")","v":"-"},{"$f":"IFERROR(H94/SUM($G$94:$M$94),\"-\")","v":"-"},"-","-","-","-","-"]
[]
["Produto Mais vendido"]
[1,{"$f":"IFERROR(INDEX(Produtos!$B:$B,MATCH(A98,Produtos!$I:$I,0),1),\"-\")","v":"-"},{"$f":"IFERROR(INDEX(Produtos!$H:$H,MATCH(A98,Produtos!$I:$I,0),1),\"-\")","v":"-"},null,null,null,null,null,null,null,null,"Dia Específico","Incremento","Máximo do Mês"]
[2,{"$f":"IFERROR(INDEX(Produtos!$B:$B,MATCH(A99,Produtos!$I:$I,0),1),\"-\")","v":"-"},{"$f":"IFERROR(INDEX(Produtos!$H:$H,MATCH(A99,Produtos!$I:$I,0),1),\"-\")","v":"-"},null,null,null,null,null,null,null,null,{"$f":"1+M99","v":23},22,{"$f":"DAY(C82)","v":30}]
[3,{"$f":"IFERROR(INDEX(Produtos!$B:$B,MATCH(A100,Produtos!$I:$I,0),1),\"-\")","v":"-"},{"$f":"IFERROR(INDEX(Produtos!$H:$H,MATCH(A100,Produtos!$I:$I,0),1),\"-\")","v":"-"},null,null,null,null,null,null,null,"Data",{"$f":"DATE(B77,B76,L99)","v":"2023-11-23"}]
[null,null,null,null,null,null,null,null,null,null,"Faturamento",{"$f":"SUMIFS(Vendas!G:G,Vendas!A:A,L100)","v":0}]
["% do Top 3",null,{"$f":"IFERROR(SUM(C98:C100)/B85,\"-\")","v":"-"},{"$f":"IF(ISNUMBER(C102)=TRUE,\"Os 3 itens representaram \"&TEXT(C102,\"0%\")&\" das vendas do mês\",\"\")","v":""},null,null,null,null,null,null,"% com relação ao mês",{"$f":"IFERROR(L101/B85,\"-\")","v":"-"}]
[null,null,null,null,null,null,null,null,null,null,"Texto",{"$f":"\"As vendas desse dia representaram \" & TEXT(IF(L101=0,0,L102),\"0,0%\") &\" das vendas totais do mês\"","v":"As vendas desse dia representaram 0,0% das vendas totais do mês"}]
[null,null,null,"abertura","ultimo disparo validatesheet","ultimo disparo addcode"]
[]
[null,1,2,3,4,5,6,7,8,9,10,11,12,"(range também utilizado no VBA)"]
[null,"JAN","FEV","MAR","ABR","MAI","JUN","JUL","AGO","SET","OUT","NOV","DEZ","TOTAL"]
["Valor",{"$f":"SUMIFS(Vendas!$G:$G,Vendas!$H:$H,config!$B$77,Vendas!$I:$I,config!B106)","v":0},{"$f":"SUMIFS(Vendas!$G:$G,Vendas!$H:$H,config!$B$77,Vendas!$I:$I,config!C106)","v":0},{"$f":"SUMIFS(Vendas!$G:$G,Vendas!$H:$H,config!$B$77,Vendas!$I:$I,config!D106)","v":0},{"$f":"SUMIFS(Vendas!$G:$G,Vendas!$H:$H,config!$B$77,Vendas!$I:$I,config!E106)","v":0},{"$f":"SUMIFS(Vendas!$G:$G,Vendas!$H:$H,config!$B$77,Vendas!$I:$I,config!F106)","v":0},{"$f":"SUMIFS(Vendas!$G:$G,Vendas!$H:$H,config!$B$77,Vendas!$I:$I,config!G106)","v":0},{"$f":"SUMIFS(Vendas!$G:$G,Vendas!$H:$H,config!$B$77,Vendas!$I:$I,config!H106)","v":0},{"$f":"SUMIFS(Vendas!$G:$G,Vendas!$H:$H,config!$B$77,Vendas!$I:$I,config!I106)","v":0},{"$f":"SUMIFS(Vendas!$G:$G,Vendas!$H:$H,config!$B$77,Vendas!$I:$I,config!J106)","v":0},{"$f":"SUMIFS(Vendas!$G:$G,Vendas!$H:$H,config!$B$77,Vendas!$I:$I,config!K106)","v":0},{"$f":"SUMIFS(Vendas!$G:$G,Vendas!$H:$H,config!$B$77,Vendas!$I:$I,config!L106)","v":0},{"$f":"SUMIFS(Vendas!$G:$G,Vendas!$H:$H,config!$B$77,Vendas!$I:$I,config!M106)","v":0},{"$f":"SUM(B108:M108)","v":0}]
[]
[]
[]
[]
[]
[]
[]
[]
["Análise por item"]
[]
["ITEM",1,2,3,4,5,6,7,8,9,10,11,12]
[{"$f":"'Dashboard Análise'!B55","v":"Celular GammaZ"},"JAN","FEV","MAR","ABR","MAI","JUN","JUL","AGO","SET","OUT","NOV","DEZ","TOTAL"]
{"$rows_left_out":16}
{"sheet":"Vendas","index":8,"n_rows":1,"n_cols":11,"rows_kept":1,"cut":false,"hidden":true,"merged":[]}
["Data","Pedido","Cliente","Produto","Qtd","Valor Unitário","Valor Total","Ano","Mês","Dia","NF"]

{"sheet":"Produtos","index":9,"n_rows":1,"n_cols":10,"rows_kept":1,"cut":false,"hidden":true,"merged":[]}
["Código Produto","Descrição","Valor Venda","Especificação 1","Especificação 2","Especificação 3","Desativado?","Dash Analise - Faturamento Período","Rank Período","Desempate"]

{"sheet":"Clientes","index":10,"n_rows":1,"n_cols":9,"rows_kept":1,"cut":false,"hidden":true,"merged":[]}
["Código Cliente","Nome","Email","Telefone","Cidade","Estado","Parâmetro 1","Parâmetro 2","Parâmetro 3"]